[bt-devel] error while compiling

Fred Saalbach bt-devel@crosswire.org
Wed, 06 Mar 2002 10:43:35 -0500


Apparently something is broken.  Bibletime built OK on March 3.  Today I
get the following.  --  Same sword version each time.

Fred Saalbach
----------------------------


[fks00@localhost bibletime]$ make
make  all-recursive
make[1]: Entering directory
`/home/fks00/Develop/cvs_repository/bibletime'
Making all in bibletime
make[2]: Entering directory
`/home/fks00/Develop/cvs_repository/bibletime/bibletime'
Making all in backend
make[3]: Entering directory
`/home/fks00/Develop/cvs_repository/bibletime/bibletime/backend'
c++ -DHAVE_CONFIG_H -I. -I. -I../.. -I/usr/lib/qt2/include
-I/usr/X11R6/include  -I/usr/include/sword  -D_REENTRANT
-DQT_NO_ASCII_CAST -DQT_NO_COMPAT -DQT_CLEAN_NAMESPACE  -O2
-fno-exceptions -fno-check-new -c cswordmodulesearch.cpp
cswordmodulesearch.cpp: In function `void *startSearchCallback (void
*)':
cswordmodulesearch.cpp:40: warning: no return statement in function
returning non-void
c++ -DHAVE_CONFIG_H -I. -I. -I../.. -I/usr/lib/qt2/include
-I/usr/X11R6/include  -I/usr/include/sword  -D_REENTRANT
-DQT_NO_ASCII_CAST -DQT_NO_COMPAT -DQT_CLEAN_NAMESPACE  -O2
-fno-exceptions -fno-check-new -c chtmlchapterdisplay.cpp
chtmlchapterdisplay.cpp:90:2: warning: #warning make table colors
configurable
c++ -DHAVE_CONFIG_H -I. -I. -I../.. -I/usr/lib/qt2/include
-I/usr/X11R6/include  -I/usr/include/sword  -D_REENTRANT
-DQT_NO_ASCII_CAST -DQT_NO_COMPAT -DQT_CLEAN_NAMESPACE  -O2
-fno-exceptions -fno-check-new -c chtmlentrydisplay.cpp
c++ -DHAVE_CONFIG_H -I. -I. -I../.. -I/usr/lib/qt2/include
-I/usr/X11R6/include  -I/usr/include/sword  -D_REENTRANT
-DQT_NO_ASCII_CAST -DQT_NO_COMPAT -DQT_CLEAN_NAMESPACE  -O2
-fno-exceptions -fno-check-new -c cswordbackend.cpp
cswordbackend.cpp: In method `void CSwordBackend::Load ()':
cswordbackend.cpp:282: `homeConfig' undeclared (first use this
function)
cswordbackend.cpp:282: (Each undeclared identifier is reported only
once for each function it appears in.)
cswordbackend.cpp: In method `const SWVersion CSwordBackend::Version
()':
cswordbackend.cpp:472: warning: cannot pass objects of non-POD type
`class SWVersion' through `...'
make[3]: *** [cswordbackend.o] Error 1
make[3]: Leaving directory
`/home/fks00/Develop/cvs_repository/bibletime/bibletime/backend'
make[2]: *** [all-recursive] Error 1
make[2]: Leaving directory
`/home/fks00/Develop/cvs_repository/bibletime/bibletime'
make[1]: *** [all-recursive] Error 1
make[1]: Leaving directory
`/home/fks00/Develop/cvs_repository/bibletime'
make: *** [all-recursive-am] Error 2
[fks00@localhost bibletime]$